ZABBIX BUGS AND ISSUES

server crash in escalator while expanding macros

Details

  • Type: Bug Bug
  • Status: Closed Closed
  • Priority: Blocker Blocker
  • Resolution: Fixed
  • Affects Version/s: None
  • Fix Version/s: 1.8.5
  • Component/s: Server (S)
  • Labels:
    None
  • Environment:
    CentOS release 5.4
    Linux domain 2.6.18-164.15.1.el5 #1 SMP Wed Mar 17 11:37:14 EDT 2010 i686 athlon i386 GNU/Linux

    Zabbix 1.8.5rc1 (revision 18438).
  • Zabbix ID:
    NA

Description

server crashed when nodata() used with new items.
  1. diz.dmp.bz2
    2011 Mar 18 20:58
    3.33 MB
    Vyacheslav
  2. zabbix_server.log
    2011 Mar 18 20:42
    21 kB
    Vyacheslav

Issue Links

Activity

Hide
Alexander Vladishev added a comment -

Thank you for reporting this issue.

Please attach a disassembly listing of zabbix_server. This listing can be produced with `objdump -D -S zabbix_server`

Show
Alexander Vladishev added a comment - Thank you for reporting this issue. Please attach a disassembly listing of zabbix_server. This listing can be produced with `objdump -D -S zabbix_server`
Hide
Vyacheslav added a comment -

ok, take it

Show
Vyacheslav added a comment - ok, take it
Hide
Vyacheslav added a comment -

first time I got this bug on Zabbix 1.8.4 (release)

Show
Vyacheslav added a comment - first time I got this bug on Zabbix 1.8.4 (release)
Hide
richlv added a comment -

quite likely same as ZBX-3630

Show
richlv added a comment - quite likely same as ZBX-3630
Hide
Vyacheslav added a comment -

don't know, but this happens just after I imported about 15 snmp host via single xml-file

Show
Vyacheslav added a comment - don't know, but this happens just after I imported about 15 snmp host via single xml-file
Hide
Alexander Vladishev added a comment -

Fixed in development branch svn://svn.zabbix.com/branches/dev/ZBX-3628

Show
Alexander Vladishev added a comment - Fixed in development branch svn://svn.zabbix.com/branches/dev/ZBX-3628
Hide
Vyacheslav added a comment -

I think this revision is broken, it shows compilation error on target centos and my desktop gentoo x64:

Making install in zbxdbhigh
make[3]: Entering directory `/root/zabbix/0/ZBX-3628/src/libs/zbxdbhigh'
make[3]: *** No rule to make target `dbschema.c', needed by `libzbxdbhigh_a-dbschema.o'. Stop.
make[3]: Leaving directory `/root/zabbix/0/ZBX-3628/src/libs/zbxdbhigh'
make[2]: *** [install-recursive] Error 1
make[2]: Leaving directory `/root/zabbix/0/ZBX-3628/src/libs'
make[1]: *** [install-recursive] Error 1
make[1]: Leaving directory `/root/zabbix/0/ZBX-3628/src'
make: *** [install-recursive] Error 1

Show
Vyacheslav added a comment - I think this revision is broken, it shows compilation error on target centos and my desktop gentoo x64: Making install in zbxdbhigh make[3]: Entering directory `/root/zabbix/0/ZBX-3628/src/libs/zbxdbhigh' make[3]: *** No rule to make target `dbschema.c', needed by `libzbxdbhigh_a-dbschema.o'. Stop. make[3]: Leaving directory `/root/zabbix/0/ZBX-3628/src/libs/zbxdbhigh' make[2]: *** [install-recursive] Error 1 make[2]: Leaving directory `/root/zabbix/0/ZBX-3628/src/libs' make[1]: *** [install-recursive] Error 1 make[1]: Leaving directory `/root/zabbix/0/ZBX-3628/src' make: *** [install-recursive] Error 1
Hide
Aleksandrs Saveljevs added a comment -

You should run "make dbschema" before "make" or "make install".

Show
Aleksandrs Saveljevs added a comment - You should run "make dbschema" before "make" or "make install".
Hide
Vyacheslav added a comment -

tnx Aleksandrs, it helps.
now it works, but on start it produced 400kb log with errors like this:
777:20110321:221334.325 Expression tok0-block-tok#0 cannot be evaluated: Evaluation failed for function: {lenina_9:net.speed.if16.abschange(0)}

Show
Vyacheslav added a comment - tnx Aleksandrs, it helps. now it works, but on start it produced 400kb log with errors like this: 777:20110321:221334.325 Expression tok0-block-tok#0 cannot be evaluated: Evaluation failed for function: {lenina_9:net.speed.if16.abschange(0)}
Hide
Aleksandrs Saveljevs added a comment -

Vyacheslav, changes in this development branch should not have affected evaluation of functions. In particular, abschange() can only fail if item does not have a previous value. So you can probably safely disregard that error message.

Show
Aleksandrs Saveljevs added a comment - Vyacheslav, changes in this development branch should not have affected evaluation of functions. In particular, abschange() can only fail if item does not have a previous value. So you can probably safely disregard that error message.
Hide
Alexander Vladishev added a comment -

Fixed in version pre1.8.5, r18609.

Show
Alexander Vladishev added a comment - Fixed in version pre1.8.5, r18609.

People

Vote (0)
Watch (0)

Dates

  • Created:
    Updated:
    Resolved: