-
Incident report
-
Resolution: Unresolved
-
Trivial
-
None
-
4.2.6
-
None
-
CentOS 8.0 + Zabbix 4.2.6 + Httpd 2.4.41 + PHP 7.2.23 + MySQL 8.0.17
openssl 1.1.1d
fping 4.2
zlib 1.2.11
libssh2 1.9.0
nghttp2 1.39.2
curl 7.66.0
re2c 1.2.1
bison 3.4.2
Steps to reproduce:
- ./configure --prefix=/usr/local/zabbix --with-mysql=/usr/local/mysql/bin/mysql_config --with-libpcre-include=/usr/local/pcre/include --with-libpcre-lib=/usr/local/pcre/lib --with-libcurl=/usr/local/curl/bin/curl-config --with-ssh2=/usr/local/libssh2 --with-zlib-include=/usr/local/zlib/include --with-zlib-lib=/usr/local/zlib/lib --with-libxml2 --with-iconv-include --enable-ipv6 --enable-server --enable-agent --with-openssl=/usr/local/openssl
- make or make install
- error ......
Result:
rm -f libzbxserver.a ar cru libzbxserver.a libzbxserver_a-actions.o libzbxserver_a-operations.o libzbxserver_a-events.o libzbxserver_a-postinit.o ranlib libzbxserver.a cc -DHAVE_CONFIG_H -I. -I../../include -DDEFAULT_SSL_CERT_LOCATION="\"/usr/local/zabbix/share/zabbix/ssl/certs\"" -DDEFAULT_SSL_KEY_LOCATION="\"/usr/local/zabbix/share/zabbix/ssl/keys\"" -DDEFAULT_CONFIG_FILE="\"/usr/local/zabbix/etc/zabbix_server.conf\"" -DDEFAULT_EXTERNAL_SCRIPTS_PATH="\"/usr/local/zabbix/share/zabbix/externalscripts\"" -DDEFAULT_ALERT_SCRIPTS_PATH="\"/usr/local/zabbix/share/zabbix/alertscripts\"" -DDEFAULT_LOAD_MODULE_PATH="\"/usr/local/zabbix/lib/modules\"" -I/usr/local/curl/include -g -O2 -I/usr/local/pcre/include -MT zabbix_server-server.o -MD -MP -MF .deps/zabbix_server-server.Tpo -c -o zabbix_server-server.o `test -f 'server.c' || echo './'`server.c mv -f .deps/zabbix_server-server.Tpo .deps/zabbix_server-server.Po cc -DDEFAULT_SSL_CERT_LOCATION="\"/usr/local/zabbix/share/zabbix/ssl/certs\"" -DDEFAULT_SSL_KEY_LOCATION="\"/usr/local/zabbix/share/zabbix/ssl/keys\"" -DDEFAULT_CONFIG_FILE="\"/usr/local/zabbix/etc/zabbix_server.conf\"" -DDEFAULT_EXTERNAL_SCRIPTS_PATH="\"/usr/local/zabbix/share/zabbix/externalscripts\"" -DDEFAULT_ALERT_SCRIPTS_PATH="\"/usr/local/zabbix/share/zabbix/alertscripts\"" -DDEFAULT_LOAD_MODULE_PATH="\"/usr/local/zabbix/lib/modules\"" -I/usr/local/curl/include -g -O2 -I/usr/local/pcre/include -L/usr/local/mysql/lib -L/usr/local/libssh2/lib -L/usr/local/zlib/lib -L/usr/local/openssl/lib -L/usr/local/curl/lib -rdynamic -L/usr/local/pcre/lib -o zabbix_server zabbix_server-server.o alerter/libzbxalerter.a dbsyncer/libzbxdbsyncer.a dbconfig/libzbxdbconfig.a discoverer/libzbxdiscoverer.a pinger/libzbxpinger.a poller/libzbxpoller.a housekeeper/libzbxhousekeeper.a timer/libzbxtimer.a trapper/libzbxtrapper.a snmptrapper/libzbxsnmptrapper.a httppoller/libzbxhttppoller.a escalator/libzbxescalator.a proxypoller/libzbxproxypoller.a selfmon/libzbxselfmon.a vmware/libzbxvmware.a taskmanager/libzbxtaskmanager.a odbc/libzbxodbc.a scripts/libzbxscripts.a preprocessor/libpreprocessor.a ../../src/libs/zbxembed/libzbxembed.a poller/libzbxpoller_server.a lld/libzbxlld.a libzbxserver.a ../../src/libs/zbxprometheus/libzbxprometheus.a ../../src/libs/zbxsysinfo/libzbxserversysinfo.a ../../src/libs/zbxsysinfo/common/libcommonsysinfo.a ../../src/libs/zbxsysinfo/simple/libsimplesysinfo.a ../../src/libs/zbxlog/libzbxlog.a ../../src/libs/zbxserver/libzbxserver.a ../../src/libs/zbxdbcache/libzbxdbcache.a ../../src/libs/zbxhistory/libzbxhistory.a ../../src/libs/zbxmemory/libzbxmemory.a ../../src/libs/zbxregexp/libzbxregexp.a ../../src/libs/zbxself/libzbxself.a ../../src/libs/zbxnix/libzbxnix.a ../../src/libs/zbxalgo/libzbxalgo.a ../../src/libs/zbxsys/libzbxsys.a ../../src/libs/zbxconf/libzbxconf.a ../../src/libs/zbxmedia/libzbxmedia.a ../../src/libs/zbxcommon/libzbxcommon.a ../../src/libs/zbxcrypto/libzbxcrypto.a ../../src/libs/zbxcomms/libzbxcomms.a ../../src/libs/zbxcommshigh/libzbxcommshigh.a ../../src/libs/zbxjson/libzbxjson.a ../../src/libs/zbxhttp/libzbxhttp.a ../../src/libs/zbxipcservice/libzbxipcservice.a ../../src/libs/zbxexec/libzbxexec.a ../../src/libs/zbxicmpping/libzbxicmpping.a ../../src/libs/zbxdbupgrade/libzbxdbupgrade.a ../../src/libs/zbxdbhigh/libzbxdbhigh.a ../../src/libs/zbxdb/libzbxdb.a ../../src/libs/zbxmodules/libzbxmodules.a ../../src/libs/zbxtasks/libzbxtasks.a ../../src/libs/zbxcompress/libzbxcompress.a ../../src/libs/zbxserver/libzbxserver_server.a -lmysqlclient -lpthread -lm -lrt -lssl -lcrypto -ldl -lxml2 -lssh2 -lz -lpthread -levent -lssl -lcrypto -lcurl -lm -ldl -lresolv -lpcre /usr/bin/ld: warning: libssl.so.1.1, needed by /usr/local/libssh2/lib/libssh2.so, may conflict with libssl.so.1.0.0 /usr/bin/ld: warning: libssl.so.1.1, needed by /usr/local/libssh2/lib/libssh2.so, may conflict with libssl.so.1.0.0 /usr/bin/ld: ../../src/libs/zbxcrypto/libzbxcrypto.a(libzbxcrypto_a-tls.o): undefined reference to symbol 'SSL_CTX_set_ciphersuites@@OPENSSL_1_1_1' //usr/local/openssl/lib/libssl.so.1.1: error adding symbols: DSO missing from command line collect2: error: ld returned 1 exit status make[3]: *** [Makefile:657: zabbix_server] Error 1 make[3]: Leaving directory '/seeyon/scripts/zabbix-4.2.6/src/zabbix_server' make[2]: *** [Makefile:764: install-recursive] Error 1 make[2]: Leaving directory '/seeyon/scripts/zabbix-4.2.6/src/zabbix_server' make[1]: *** [Makefile:482: install-recursive] Error 1 make[1]: Leaving directory '/seeyon/scripts/zabbix-4.2.6/src' make: *** [Makefile:531: install-recursive] Error 1
Expected:
See screenshot....
See attached patch file...