Uploaded image for project: 'ZABBIX BUGS AND ISSUES'
  1. ZABBIX BUGS AND ISSUES
  2. ZBX-17252

Build fails: missing zbx_update_resolver_conf symbol on linking zabbix_js

    XMLWordPrintable

    Details

    • Team:
      Team A
    • Sprint:
      Sprint 63 (Apr 2020), Sprint 64 (May 2020), Sprint 65 (Jun 2020), Sprint 66 (Jul 2020)
    • Story Points:
      0.5

      Description

       

      make[2]: Leaving directory '/home/tkloczko/rpmbuild/BUILD/zabbix-4.4.5/x86_64-redhat-linux-gnu-mysql/src/zabbix_js'
      make[2]: Entering directory '/home/tkloczko/rpmbuild/BUILD/zabbix-4.4.5/x86_64-redhat-linux-gnu-mysql/src/zabbix_js'
      /bin/sh ../../libtool --tag=CC --mode=link gcc -O2 -g -pipe -Wall -Werror=format-security -Wp,-D_FORTIFY_SOURCE=2 -Wp,-D_GLIBCXX_ASSERTIONS -fstack-protector-strong -grecord-gcc-switches -specs=/usr/lib/rpm/redhat/redhat-hardened-cc1 -specs=/usr/lib/rpm/redhat/redhat-annobin-cc1 -m64 -mtune=generic -fasynchronous-unwind-tables -fstack-clash-protection -fcf-protection -L/usr/lib -rdynamic -Wl,-z,relro -Wl,--as-needed -Wl,-z,now -specs=/usr/lib/rpm/redhat/redhat-hardened-ld -o zabbix_js zabbix_js.o ../../src/libs/zbxlog/libzbxlog.a ../../src/libs/zbxembed/libzbxembed.a ../../src/libs/zbxjson/libzbxjson.a ../../src/libs/zbxregexp/libzbxregexp.a ../../src/libs/zbxalgo/libzbxalgo.a ../../src/libs/zbxsys/libzbxsys.a ../../src/libs/zbxnix/libzbxnix.a ../../src/libs/zbxcommon/libzbxcommon.a ../../src/libs/zbxcomms/libzbxcomms.a ../../src/libs/zbxconf/libzbxconf.a ../../src/libs/zbxcommon/libzbxcommon.a ../../src/libs/zbxcrypto/libzbxcrypto.a ../../src/libs/zbxcompress/libzbxcompress.a -lz -lpthread -lssl -lcrypto -lcurl -lm -ldl -lresolv -lpcre
      libtool: link: gcc -O2 -g -pipe -Wall -Werror=format-security -Wp,-D_FORTIFY_SOURCE=2 -Wp,-D_GLIBCXX_ASSERTIONS -fstack-protector-strong -grecord-gcc-switches -specs=/usr/lib/rpm/redhat/redhat-hardened-cc1 -specs=/usr/lib/rpm/redhat/redhat-annobin-cc1 -m64 -mtune=generic -fasynchronous-unwind-tables -fstack-clash-protection -fcf-protection -rdynamic -Wl,-z -Wl,relro -Wl,--as-needed -Wl,-z -Wl,now -specs=/usr/lib/rpm/redhat/redhat-hardened-ld -o zabbix_js zabbix_js.o -L/usr/lib ../../src/libs/zbxlog/libzbxlog.a ../../src/libs/zbxembed/libzbxembed.a ../../src/libs/zbxjson/libzbxjson.a ../../src/libs/zbxregexp/libzbxregexp.a ../../src/libs/zbxalgo/libzbxalgo.a ../../src/libs/zbxsys/libzbxsys.a ../../src/libs/zbxnix/libzbxnix.a ../../src/libs/zbxcomms/libzbxcomms.a ../../src/libs/zbxconf/libzbxconf.a ../../src/libs/zbxcommon/libzbxcommon.a ../../src/libs/zbxcrypto/libzbxcrypto.a ../../src/libs/zbxcompress/libzbxcompress.a -lz -lpthread -lssl -lcrypto -lcurl -lm -ldl -lresolv -lpcre
      /usr/bin/ld: ../../src/libs/zbxcommon/libzbxcommon.a(libzbxcommon_a-misc.o): in function `zbx_update_env':
      /home/tkloczko/rpmbuild/BUILD/zabbix-4.4.5/x86_64-redhat-linux-gnu-mysql/src/libs/zbxcommon/../../../../src/libs/zbxcommon/misc.c:3770: undefined reference to `zbx_update_resolver_conf'
      collect2: error: ld returned 1 exit status
      make[2]: *** [Makefile:523: zabbix_js] Error 1
      make[2]: Leaving directory '/home/tkloczko/rpmbuild/BUILD/zabbix-4.4.5/x86_64-redhat-linux-gnu-mysql/src/zabbix_js'
      make[1]: *** [Makefile:520: all-recursive] Error 1
      make: *** [Makefile:603: all-recursive] Error 1
       
      

       

        Attachments

          Activity

            People

            Assignee:
            vso Vladislavs Sokurenko
            Reporter:
            kloczek Tomasz Kłoczko
            Votes:
            0 Vote for this issue
            Watchers:
            8 Start watching this issue

              Dates

              Created:
              Updated:
              Resolved: