Uploaded image for project: 'ZABBIX BUGS AND ISSUES'
  1. ZABBIX BUGS AND ISSUES
  2. ZBX-18945

5.2.4 & 5.0.8 agent2 build is broken on Raspbian 10 (Buster) 32bit

    XMLWordPrintable

    Details

    • Team:
      Team A
    • Sprint:
      Sprint 72 (Jan 2021), Sprint 73 (Feb 2021)
    • Story Points:
      0.125

      Description

      5.2.4 & 5.0.8 agent2 build is broken on Raspbian 10 (Buster) 32bit

      Getting the following error:

      # zabbix.com/plugins/proc
      plugins/proc/procfs_linux.go:248:6: constant 1099511627776 overflows int
      
      make[2]: *** [Makefile:546: install] Error 2
      make[2]: Leaving directory '/home/pi/zabbix-5.2.4/src/go'
      make[1]: *** [Makefile:498: install-recursive] Error 1
      make[1]: Leaving directory '/home/pi/zabbix-5.2.4/src'
      make: *** [Makefile:537: install-recursive] Error 1

      Version 5.2.3 & 5.0.7 build fine.

      This prevents us from providing agent2 package for raspbian.

        Attachments

          Issue Links

            Activity

              People

              Assignee:
              esneiders Eriks Sneiders
              Reporter:
              yurii Jurijs Klopovskis
              Votes:
              0 Vote for this issue
              Watchers:
              4 Start watching this issue

                Dates

                Created:
                Updated:
                Resolved: