Uploaded image for project: 'ZABBIX BUGS AND ISSUES'
  1. ZABBIX BUGS AND ISSUES
  2. ZBX-22384

Zabbix agent 2 compilation fails on macOS

    XMLWordPrintable

Details

    • Problem report
    • Resolution: Fixed
    • Trivial
    • 6.4.0rc2, 6.4 (plan)
    • 6.4.0rc1
    • Agent (G)
    • None
    • Team A
    • Sprint 97 (Feb 2023)
    • 0.125

    Description

      1. zabbix.com/plugins/system/sw
        plugins/system/sw/sw.go:59:19: p.systemSwPackages undefined (type *Plugin has no field or method systemSwPackages)
        plugins/system/sw/sw.go:62:19: p.systemSwPackagesGet undefined (type *Plugin has no field or method systemSwPackagesGet)
        plugins/system/sw/sw.go:69:19: p.getOSVersion undefined (type *Plugin has no field or method getOSVersion)
        plugins/system/sw/sw.go:75:19: p.getOSVersionJSON undefined (type *Plugin has no field or method getOSVersionJSON)
        make[3]: *** [install-zabbix.com/cmd/zabbix_agent2] Error 2
        make[2]: *** [install-am] Error 2
        make[1]: *** [install-recursive] Error 1
        make: *** [install-recursive] Error 1

      Attachments

        Activity

          People

            vso Vladislavs Sokurenko
            vso Vladislavs Sokurenko
            Votes:
            0 Vote for this issue
            Watchers:
            3 Start watching this issue

            Dates

              Created:
              Updated:
              Resolved: